{"text_format":"1","workbook":"xlsx","n_sheets":3,"sheets":["Introduction","7 day chart","Half-hour data"],"not_rendered":{"charts":1,"images":0,"macros":1,"external_links":0,"defined_names":5,"comments":0,"pivot_tables":0},"unopened":[],"bounds":{"document_bytes":16777216,"sheet_cells":100000,"rows_first":2000,"rows_last":500,"rows_between":2000,"halvings":0,"cell_chars":16384,"cell_head_chars":4096},"cells_cut":0,"cells_raw":0,"read":"whole","date_system":"1900"}

{"sheet":"Introduction","index":0,"n_rows":21,"n_cols":2,"rows_kept":21,"cut":false,"hidden":false,"merged":[]}
[]
[null,"HHD Profiler  - produces a 7 day chart of 24 hour kW profiles from half-hourly kWh data"]
[]
[null,"You can:"]
[null,"– click buttons to shift a chart forwards or backwards in time by one week, four weeks, or 52 weeks,"]
[null,"– use the automatic maximum for the kW chart axis, or set the maximum to allow comparing of different periods"]
[null,"Only the yellow cells and [site name] should normally be changed."]
[]
{"$rows_left_out":14}
{"sheet":"7 day chart","index":1,"n_rows":33,"n_cols":61,"rows_kept":33,"cut":false,"hidden":false,"merged":[[16,0,17,0]]}
[]
["Set the chart date here or shift the chart week using buttons",null,null,null,null,null,null,"7 day dates","Day","Row","Month","Chart time:",{"$f":"IF(AND(K9>=K4,K3>=4,K9<=10),\"BST\",\"GMT\")","v":"GMT"},{"$f":"IF($O$28,N11,N10)","v":"00:00:00"},"00:30:00","01:00:00","01:30:00","02:00:00","02:30:00","03:00:00","03:30:00","04:00:00","04:30:00","05:00:00","05:30:00","06:00:00","06:30:00","07:00:00","07:30:00","08:00:00","08:30:00","09:00:00","09:30:00","10:00:00","10:30:00","11:00:00","11:30:00","12:00:00","12:30:00","13:00:00","13:30:00","14:00:00","14:30:00","15:00:00","15:30:00","16:00:00","16:30:00","17:00:00","17:30:00","18:00:00","18:30:00","19:00:00","19:30:00","20:00:00","20:30:00","21:00:00","21:30:00","22:00:00","22:30:00","23:00:00","23:30:00"]
["2024-01-08",null,null,null,null,null,null,{"$f":"A3-WEEKDAY(A3,2)+1","v":"2024-01-08"},{"$f":"WEEKDAY(H3,2)","v":1},{"$f":"H3-$N$28+2","v":1104},{"$f":"MONTH(H3)","v":1},null,"Mon",{"$f":"2*INDEX('Half-hour data'!$A:$AX,$J3,COLUMN()-11)","v":28},{"$f":"2*INDEX('Half-hour data'!$A:$AX,$J3,COLUMN()-11)","v":27.4},{"$f":"2*INDEX('Half-hour data'!$A:$AX,$J3,COLUMN()-11)","v":31.2},{"$f":"2*INDEX('Half-hour data'!$A:$AX,$J3,COLUMN()-11)","v":31},{"$f":"2*INDEX('Half-hour data'!$A:$AX,$J3,COLUMN()-11)","v":29.6},{"$f":"2*INDEX('Half-hour data'!$A:$AX,$J3,COLUMN()-11)","v":26.6},{"$f":"2*INDEX('Half-hour data'!$A:$AX,$J3,COLUMN()-11)","v":31.2},{"$f":"2*INDEX('Half-hour data'!$A:$AX,$J3,COLUMN()-11)","v":25},{"$f":"2*INDEX('Half-hour data'!$A:$AX,$J3,COLUMN()-11)","v":29.2},{"$f":"2*INDEX('Half-hour data'!$A:$AX,$J3,COLUMN()-11)","v":28.6},{"$f":"2*INDEX('Half-hour data'!$A:$AX,$J3,COLUMN()-11)","v":29},{"$f":"2*INDEX('Half-hour data'!$A:$AX,$J3,COLUMN()-11)","v":29.2},{"$f":"2*INDEX('Half-hour data'!$A:$AX,$J3,COLUMN()-11)","v":26.8},{"$f":"2*INDEX('Half-hour data'!$A:$AX,$J3,COLUMN()-11)","v":29},{"$f":"2*INDEX('Half-hour data'!$A:$AX,$J3,COLUMN()-11)","v":28},{"$f":"2*INDEX('Half-hour data'!$A:$AX,$J3,COLUMN()-11)","v":28.8},{"$f":"2*INDEX('Half-hour data'!$A:$AX,$J3,COLUMN()-11)","v":83.4},{"$f":"2*INDEX('Half-hour data'!$A:$AX,$J3,COLUMN()-11)","v":84.4},{"$f":"2*INDEX('Half-hour data'!$A:$AX,$J3,COLUMN()-11)","v":91.6},{"$f":"2*INDEX('Half-hour data'!$A:$AX,$J3,COLUMN()-11)","v":90},{"$f":"2*INDEX('Half-hour data'!$A:$AX,$J3,COLUMN()-11)","v":81.400000000000006},{"$f":"2*INDEX('Half-hour data'!$A:$AX,$J3,COLUMN()-11)","v":79.8},{"$f":"2*INDEX('Half-hour data'!$A:$AX,$J3,COLUMN()-11)","v":87.4},{"$f":"2*INDEX('Half-hour data'!$A:$AX,$J3,COLUMN()-11)","v":82.8},{"$f":"2*INDEX('Half-hour data'!$A:$AX,$J3,COLUMN()-11)","v":91.4},{"$f":"2*INDEX('Half-hour data'!$A:$AX,$J3,COLUMN()-11)","v":77.8},{"$f":"2*INDEX('Half-hour data'!$A:$AX,$J3,COLUMN()-11)","v":91.6},{"$f":"2*INDEX('Half-hour data'!$A:$AX,$J3,COLUMN()-11)","v":81.400000000000006},{"$f":"2*INDEX('Half-hour data'!$A:$AX,$J3,COLUMN()-11)","v":85},{"$f":"2*INDEX('Half-hour data'!$A:$AX,$J3,COLUMN()-11)","v":89.8},{"$f":"2*INDEX('Half-hour data'!$A:$AX,$J3,COLUMN()-11)","v":84.8},{"$f":"2*INDEX('Half-hour data'!$A:$AX,$J3,COLUMN()-11)","v":78},{"$f":"2*INDEX('Half-hour data'!$A:$AX,$J3,COLUMN()-11)","v":71.599999999999994},{"$f":"2*INDEX('Half-hour data'!$A:$AX,$J3,COLUMN()-11)","v":68.2},{"$f":"2*INDEX('Half-hour data'!$A:$AX,$J3,COLUMN()-11)","v":72.400000000000006},{"$f":"2*INDEX('Half-hour data'!$A:$AX,$J3,COLUMN()-11)","v":50.6},{"$f":"2*INDEX('Half-hour data'!$A:$AX,$J3,COLUMN()-11)","v":56.4},{"$f":"2*INDEX('Half-hour data'!$A:$AX,$J3,COLUMN()-11)","v":53},{"$f":"2*INDEX('Half-hour data'!$A:$AX,$J3,COLUMN()-11)","v":48.6},{"$f":"2*INDEX('Half-hour data'!$A:$AX,$J3,COLUMN()-11)","v":47.6},{"$f":"2*INDEX('Half-hour data'!$A:$AX,$J3,COLUMN()-11)","v":50},{"$f":"2*INDEX('Half-hour data'!$A:$AX,$J3,COLUMN()-11)","v":35.6},{"$f":"2*INDEX('Half-hour data'!$A:$AX,$J3,COLUMN()-11)","v":26.8},{"$f":"2*INDEX('Half-hour data'!$A:$AX,$J3,COLUMN()-11)","v":26.8},{"$f":"2*INDEX('Half-hour data'!$A:$AX,$J3,COLUMN()-11)","v":28.8},{"$f":"2*INDEX('Half-hour data'!$A:$AX,$J3,COLUMN()-11)","v":27.4},{"$f":"2*INDEX('Half-hour data'!$A:$AX,$J3,COLUMN()-11)","v":31},{"$f":"2*INDEX('Half-hour data'!$A:$AX,$J3,COLUMN()-11)","v":27.6}]
[null,null,null,null,null,null,null,{"$f":"H3+1","v":"2024-01-09"},{"$f":"WEEKDAY(H4,2)","v":2},1105,{"$f":"MONTH(H4)","v":1},null,"Tue",{"$f":"2*INDEX('Half-hour data'!$A:$AX,$J4,COLUMN()-11)","v":28.4},{"$f":"2*INDEX('Half-hour data'!$A:$AX,$J4,COLUMN()-11)","v":32.4},{"$f":"2*INDEX('Half-hour data'!$A:$AX,$J4,COLUMN()-11)","v":27.4},{"$f":"2*INDEX('Half-hour data'!$A:$AX,$J4,COLUMN()-11)","v":32.200000000000003},{"$f":"2*INDEX('Half-hour data'!$A:$AX,$J4,COLUMN()-11)","v":27.6},{"$f":"2*INDEX('Half-hour data'!$A:$AX,$J4,COLUMN()-11)","v":27.6},{"$f":"2*INDEX('Half-hour data'!$A:$AX,$J4,COLUMN()-11)","v":32.200000000000003},{"$f":"2*INDEX('Half-hour data'!$A:$AX,$J4,COLUMN()-11)","v":28.6},{"$f":"2*INDEX('Half-hour data'!$A:$AX,$J4,COLUMN()-11)","v":27.6},{"$f":"2*INDEX('Half-hour data'!$A:$AX,$J4,COLUMN()-11)","v":31.6},{"$f":"2*INDEX('Half-hour data'!$A:$AX,$J4,COLUMN()-11)","v":26.4},{"$f":"2*INDEX('Half-hour data'!$A:$AX,$J4,COLUMN()-11)","v":31.8},{"$f":"2*INDEX('Half-hour data'!$A:$AX,$J4,COLUMN()-11)","v":31.6},{"$f":"2*INDEX('Half-hour data'!$A:$AX,$J4,COLUMN()-11)","v":28.8},{"$f":"2*INDEX('Half-hour data'!$A:$AX,$J4,COLUMN()-11)","v":33.6},{"$f":"2*INDEX('Half-hour data'!$A:$AX,$J4,COLUMN()-11)","v":50.6},{"$f":"2*INDEX('Half-hour data'!$A:$AX,$J4,COLUMN()-11)","v":82.2},{"$f":"2*INDEX('Half-hour data'!$A:$AX,$J4,COLUMN()-11)","v":89.4},{"$f":"2*INDEX('Half-hour data'!$A:$AX,$J4,COLUMN()-11)","v":77},{"$f":"2*INDEX('Half-hour data'!$A:$AX,$J4,COLUMN()-11)","v":79.2},{"$f":"2*INDEX('Half-hour data'!$A:$AX,$J4,COLUMN()-11)","v":82.4},{"$f":"2*INDEX('Half-hour data'!$A:$AX,$J4,COLUMN()-11)","v":81},{"$f":"2*INDEX('Half-hour data'!$A:$AX,$J4,COLUMN()-11)","v":82.6},{"$f":"2*INDEX('Half-hour data'!$A:$AX,$J4,COLUMN()-11)","v":82.2},{"$f":"2*INDEX('Half-hour data'!$A:$AX,$J4,COLUMN()-11)","v":85.8},{"$f":"2*INDEX('Half-hour data'!$A:$AX,$J4,COLUMN()-11)","v":91.2},{"$f":"2*INDEX('Half-hour data'!$A:$AX,$J4,COLUMN()-11)","v":85.2},{"$f":"2*INDEX('Half-hour data'!$A:$AX,$J4,COLUMN()-11)","v":89},{"$f":"2*INDEX('Half-hour data'!$A:$AX,$J4,COLUMN()-11)","v":95},{"$f":"2*INDEX('Half-hour data'!$A:$AX,$J4,COLUMN()-11)","v":83.6},{"$f":"2*INDEX('Half-hour data'!$A:$AX,$J4,COLUMN()-11)","v":78.599999999999994},{"$f":"2*INDEX('Half-hour data'!$A:$AX,$J4,COLUMN()-11)","v":75.8},{"$f":"2*INDEX('Half-hour data'!$A:$AX,$J4,COLUMN()-11)","v":82.2},{"$f":"2*INDEX('Half-hour data'!$A:$AX,$J4,COLUMN()-11)","v":81.2},{"$f":"2*INDEX('Half-hour data'!$A:$AX,$J4,COLUMN()-11)","v":74.8},{"$f":"2*INDEX('Half-hour data'!$A:$AX,$J4,COLUMN()-11)","v":56.6},{"$f":"2*INDEX('Half-hour data'!$A:$AX,$J4,COLUMN()-11)","v":36.4},{"$f":"2*INDEX('Half-hour data'!$A:$AX,$J4,COLUMN()-11)","v":29.6},{"$f":"2*INDEX('Half-hour data'!$A:$AX,$J4,COLUMN()-11)","v":29.4},{"$f":"2*INDEX('Half-hour data'!$A:$AX,$J4,COLUMN()-11)","v":27},{"$f":"2*INDEX('Half-hour data'!$A:$AX,$J4,COLUMN()-11)","v":28.8},{"$f":"2*INDEX('Half-hour data'!$A:$AX,$J4,COLUMN()-11)","v":27.4},{"$f":"2*INDEX('Half-hour data'!$A:$AX,$J4,COLUMN()-11)","v":27.2},{"$f":"2*INDEX('Half-hour data'!$A:$AX,$J4,COLUMN()-11)","v":26.8},{"$f":"2*INDEX('Half-hour data'!$A:$AX,$J4,COLUMN()-11)","v":27.8},{"$f":"2*INDEX('Half-hour data'!$A:$AX,$J4,COLUMN()-11)","v":28},{"$f":"2*INDEX('Half-hour data'!$A:$AX,$J4,COLUMN()-11)","v":30.4},{"$f":"2*INDEX('Half-hour data'!$A:$AX,$J4,COLUMN()-11)","v":31}]
["Shift 1 week",null,null,null,null,null,null,{"$f":"H4+1","v":"2024-01-10"},3,1106,1,null,"Wed",{"$f":"2*INDEX('Half-hour data'!$A:$AX,$J5,COLUMN()-11)","v":31.4},{"$f":"2*INDEX('Half-hour data'!$A:$AX,$J5,COLUMN()-11)","v":31.6},{"$f":"2*INDEX('Half-hour data'!$A:$AX,$J5,COLUMN()-11)","v":30},{"$f":"2*INDEX('Half-hour data'!$A:$AX,$J5,COLUMN()-11)","v":30},{"$f":"2*INDEX('Half-hour data'!$A:$AX,$J5,COLUMN()-11)","v":31},{"$f":"2*INDEX('Half-hour data'!$A:$AX,$J5,COLUMN()-11)","v":28},{"$f":"2*INDEX('Half-hour data'!$A:$AX,$J5,COLUMN()-11)","v":28.6},{"$f":"2*INDEX('Half-hour data'!$A:$AX,$J5,COLUMN()-11)","v":31},{"$f":"2*INDEX('Half-hour data'!$A:$AX,$J5,COLUMN()-11)","v":29.6},{"$f":"2*INDEX('Half-hour data'!$A:$AX,$J5,COLUMN()-11)","v":30},{"$f":"2*INDEX('Half-hour data'!$A:$AX,$J5,COLUMN()-11)","v":30.8},{"$f":"2*INDEX('Half-hour data'!$A:$AX,$J5,COLUMN()-11)","v":30.8},{"$f":"2*INDEX('Half-hour data'!$A:$AX,$J5,COLUMN()-11)","v":30.2},{"$f":"2*INDEX('Half-hour data'!$A:$AX,$J5,COLUMN()-11)","v":26.2},{"$f":"2*INDEX('Half-hour data'!$A:$AX,$J5,COLUMN()-11)","v":32.4},{"$f":"2*INDEX('Half-hour data'!$A:$AX,$J5,COLUMN()-11)","v":49},{"$f":"2*INDEX('Half-hour data'!$A:$AX,$J5,COLUMN()-11)","v":83.8},{"$f":"2*INDEX('Half-hour data'!$A:$AX,$J5,COLUMN()-11)","v":78},{"$f":"2*INDEX('Half-hour data'!$A:$AX,$J5,COLUMN()-11)","v":88.2},{"$f":"2*INDEX('Half-hour data'!$A:$AX,$J5,COLUMN()-11)","v":77.599999999999994},{"$f":"2*INDEX('Half-hour data'!$A:$AX,$J5,COLUMN()-11)","v":77.8},{"$f":"2*INDEX('Half-hour data'!$A:$AX,$J5,COLUMN()-11)","v":91.6},{"$f":"2*INDEX('Half-hour data'!$A:$AX,$J5,COLUMN()-11)","v":84.6},{"$f":"2*INDEX('Half-hour data'!$A:$AX,$J5,COLUMN()-11)","v":83.6},{"$f":"2*INDEX('Half-hour data'!$A:$AX,$J5,COLUMN()-11)","v":88.4},{"$f":"2*INDEX('Half-hour data'!$A:$AX,$J5,COLUMN()-11)","v":84.8},{"$f":"2*INDEX('Half-hour data'!$A:$AX,$J5,COLUMN()-11)","v":80},{"$f":"2*INDEX('Half-hour data'!$A:$AX,$J5,COLUMN()-11)","v":74.8},{"$f":"2*INDEX('Half-hour data'!$A:$AX,$J5,COLUMN()-11)","v":82.8},{"$f":"2*INDEX('Half-hour data'!$A:$AX,$J5,COLUMN()-11)","v":79.2},{"$f":"2*INDEX('Half-hour data'!$A:$AX,$J5,COLUMN()-11)","v":76.599999999999994},{"$f":"2*INDEX('Half-hour data'!$A:$AX,$J5,COLUMN()-11)","v":70.8},{"$f":"2*INDEX('Half-hour data'!$A:$AX,$J5,COLUMN()-11)","v":68.8},{"$f":"2*INDEX('Half-hour data'!$A:$AX,$J5,COLUMN()-11)","v":67.599999999999994},{"$f":"2*INDEX('Half-hour data'!$A:$AX,$J5,COLUMN()-11)","v":60},{"$f":"2*INDEX('Half-hour data'!$A:$AX,$J5,COLUMN()-11)","v":60.4},{"$f":"2*INDEX('Half-hour data'!$A:$AX,$J5,COLUMN()-11)","v":30.8},{"$f":"2*INDEX('Half-hour data'!$A:$AX,$J5,COLUMN()-11)","v":28},{"$f":"2*INDEX('Half-hour data'!$A:$AX,$J5,COLUMN()-11)","v":26.2},{"$f":"2*INDEX('Half-hour data'!$A:$AX,$J5,COLUMN()-11)","v":25.8},{"$f":"2*INDEX('Half-hour data'!$A:$AX,$J5,COLUMN()-11)","v":27.2},{"$f":"2*INDEX('Half-hour data'!$A:$AX,$J5,COLUMN()-11)","v":28.4},{"$f":"2*INDEX('Half-hour data'!$A:$AX,$J5,COLUMN()-11)","v":25},{"$f":"2*INDEX('Half-hour data'!$A:$AX,$J5,COLUMN()-11)","v":28.4},{"$f":"2*INDEX('Half-hour data'!$A:$AX,$J5,COLUMN()-11)","v":27.2},{"$f":"2*INDEX('Half-hour data'!$A:$AX,$J5,COLUMN()-11)","v":26.8},{"$f":"2*INDEX('Half-hour data'!$A:$AX,$J5,COLUMN()-11)","v":28.8},{"$f":"2*INDEX('Half-hour data'!$A:$AX,$J5,COLUMN()-11)","v":27.6}]
[null,null,null,null,null,null,null,"2024-01-11",4,1107,1,null,"Thu",{"$f":"2*INDEX('Half-hour data'!$A:$AX,$J6,COLUMN()-11)","v":28},{"$f":"2*INDEX('Half-hour data'!$A:$AX,$J6,COLUMN()-11)","v":24.4},{"$f":"2*INDEX('Half-hour data'!$A:$AX,$J6,COLUMN()-11)","v":28.8},{"$f":"2*INDEX('Half-hour data'!$A:$AX,$J6,COLUMN()-11)","v":27.2},{"$f":"2*INDEX('Half-hour data'!$A:$AX,$J6,COLUMN()-11)","v":26.8},{"$f":"2*INDEX('Half-hour data'!$A:$AX,$J6,COLUMN()-11)","v":30.4},{"$f":"2*INDEX('Half-hour data'!$A:$AX,$J6,COLUMN()-11)","v":30.2},{"$f":"2*INDEX('Half-hour data'!$A:$AX,$J6,COLUMN()-11)","v":30.6},{"$f":"2*INDEX('Half-hour data'!$A:$AX,$J6,COLUMN()-11)","v":27.8},{"$f":"2*INDEX('Half-hour data'!$A:$AX,$J6,COLUMN()-11)","v":31},{"$f":"2*INDEX('Half-hour data'!$A:$AX,$J6,COLUMN()-11)","v":27.4},{"$f":"2*INDEX('Half-hour data'!$A:$AX,$J6,COLUMN()-11)","v":29.6},{"$f":"2*INDEX('Half-hour data'!$A:$AX,$J6,COLUMN()-11)","v":27.6},{"$f":"2*INDEX('Half-hour data'!$A:$AX,$J6,COLUMN()-11)","v":30.8},{"$f":"2*INDEX('Half-hour data'!$A:$AX,$J6,COLUMN()-11)","v":30.4},{"$f":"2*INDEX('Half-hour data'!$A:$AX,$J6,COLUMN()-11)","v":40.200000000000003},{"$f":"2*INDEX('Half-hour data'!$A:$AX,$J6,COLUMN()-11)","v":91},{"$f":"2*INDEX('Half-hour data'!$A:$AX,$J6,COLUMN()-11)","v":82},{"$f":"2*INDEX('Half-hour data'!$A:$AX,$J6,COLUMN()-11)","v":82},{"$f":"2*INDEX('Half-hour data'!$A:$AX,$J6,COLUMN()-11)","v":74.8},{"$f":"2*INDEX('Half-hour data'!$A:$AX,$J6,COLUMN()-11)","v":81},{"$f":"2*INDEX('Half-hour data'!$A:$AX,$J6,COLUMN()-11)","v":71.400000000000006},{"$f":"2*INDEX('Half-hour data'!$A:$AX,$J6,COLUMN()-11)","v":85.4},{"$f":"2*INDEX('Half-hour data'!$A:$AX,$J6,COLUMN()-11)","v":79},{"$f":"2*INDEX('Half-hour data'!$A:$AX,$J6,COLUMN()-11)","v":81.599999999999994},{"$f":"2*INDEX('Half-hour data'!$A:$AX,$J6,COLUMN()-11)","v":77.599999999999994},{"$f":"2*INDEX('Half-hour data'!$A:$AX,$J6,COLUMN()-11)","v":79.599999999999994},{"$f":"2*INDEX('Half-hour data'!$A:$AX,$J6,COLUMN()-11)","v":77.400000000000006},{"$f":"2*INDEX('Half-hour data'!$A:$AX,$J6,COLUMN()-11)","v":73.8},{"$f":"2*INDEX('Half-hour data'!$A:$AX,$J6,COLUMN()-11)","v":84.4},{"$f":"2*INDEX('Half-hour data'!$A:$AX,$J6,COLUMN()-11)","v":82.2},{"$f":"2*INDEX('Half-hour data'!$A:$AX,$J6,COLUMN()-11)","v":74.8},{"$f":"2*INDEX('Half-hour data'!$A:$AX,$J6,COLUMN()-11)","v":72},{"$f":"2*INDEX('Half-hour data'!$A:$AX,$J6,COLUMN()-11)","v":67},{"$f":"2*INDEX('Half-hour data'!$A:$AX,$J6,COLUMN()-11)","v":61.2},{"$f":"2*INDEX('Half-hour data'!$A:$AX,$J6,COLUMN()-11)","v":65.8},{"$f":"2*INDEX('Half-hour data'!$A:$AX,$J6,COLUMN()-11)","v":35.200000000000003},{"$f":"2*INDEX('Half-hour data'!$A:$AX,$J6,COLUMN()-11)","v":28.6},{"$f":"2*INDEX('Half-hour data'!$A:$AX,$J6,COLUMN()-11)","v":31.8},{"$f":"2*INDEX('Half-hour data'!$A:$AX,$J6,COLUMN()-11)","v":31.6},{"$f":"2*INDEX('Half-hour data'!$A:$AX,$J6,COLUMN()-11)","v":30.4},{"$f":"2*INDEX('Half-hour data'!$A:$AX,$J6,COLUMN()-11)","v":32.200000000000003},{"$f":"2*INDEX('Half-hour data'!$A:$AX,$J6,COLUMN()-11)","v":27.8},{"$f":"2*INDEX('Half-hour data'!$A:$AX,$J6,COLUMN()-11)","v":28.8},{"$f":"2*INDEX('Half-hour data'!$A:$AX,$J6,COLUMN()-11)","v":29.4},{"$f":"2*INDEX('Half-hour data'!$A:$AX,$J6,COLUMN()-11)","v":28},{"$f":"2*INDEX('Half-hour data'!$A:$AX,$J6,COLUMN()-11)","v":27.8},{"$f":"2*INDEX('Half-hour data'!$A:$AX,$J6,COLUMN()-11)","v":28.8}]
["Shift 4 weeks",null,null,null,null,null,null,"2024-01-12",5,1108,1,null,"Fri",{"$f":"2*INDEX('Half-hour data'!$A:$AX,$J7,COLUMN()-11)","v":27.8},{"$f":"2*INDEX('Half-hour data'!$A:$AX,$J7,COLUMN()-11)","v":26.8},{"$f":"2*INDEX('Half-hour data'!$A:$AX,$J7,COLUMN()-11)","v":31.6},{"$f":"2*INDEX('Half-hour data'!$A:$AX,$J7,COLUMN()-11)","v":30.4},{"$f":"2*INDEX('Half-hour data'!$A:$AX,$J7,COLUMN()-11)","v":31},{"$f":"2*INDEX('Half-hour data'!$A:$AX,$J7,COLUMN()-11)","v":28},{"$f":"2*INDEX('Half-hour data'!$A:$AX,$J7,COLUMN()-11)","v":26.6},{"$f":"2*INDEX('Half-hour data'!$A:$AX,$J7,COLUMN()-11)","v":28},{"$f":"2*INDEX('Half-hour data'!$A:$AX,$J7,COLUMN()-11)","v":29.6},{"$f":"2*INDEX('Half-hour data'!$A:$AX,$J7,COLUMN()-11)","v":27.2},{"$f":"2*INDEX('Half-hour data'!$A:$AX,$J7,COLUMN()-11)","v":30.6},{"$f":"2*INDEX('Half-hour data'!$A:$AX,$J7,COLUMN()-11)","v":28.8},{"$f":"2*INDEX('Half-hour data'!$A:$AX,$J7,COLUMN()-11)","v":27.8},{"$f":"2*INDEX('Half-hour data'!$A:$AX,$J7,COLUMN()-11)","v":29.6},{"$f":"2*INDEX('Half-hour data'!$A:$AX,$J7,COLUMN()-11)","v":30.6},{"$f":"2*INDEX('Half-hour data'!$A:$AX,$J7,COLUMN()-11)","v":67},{"$f":"2*INDEX('Half-hour data'!$A:$AX,$J7,COLUMN()-11)","v":90.8},{"$f":"2*INDEX('Half-hour data'!$A:$AX,$J7,COLUMN()-11)","v":87.2},{"$f":"2*INDEX('Half-hour data'!$A:$AX,$J7,COLUMN()-11)","v":86.2},{"$f":"2*INDEX('Half-hour data'!$A:$AX,$J7,COLUMN()-11)","v":82.8},{"$f":"2*INDEX('Half-hour data'!$A:$AX,$J7,COLUMN()-11)","v":78.8},{"$f":"2*INDEX('Half-hour data'!$A:$AX,$J7,COLUMN()-11)","v":94.2},{"$f":"2*INDEX('Half-hour data'!$A:$AX,$J7,COLUMN()-11)","v":94.4},{"$f":"2*INDEX('Half-hour data'!$A:$AX,$J7,COLUMN()-11)","v":95.2},{"$f":"2*INDEX('Half-hour data'!$A:$AX,$J7,COLUMN()-11)","v":88},{"$f":"2*INDEX('Half-hour data'!$A:$AX,$J7,COLUMN()-11)","v":91.6},{"$f":"2*INDEX('Half-hour data'!$A:$AX,$J7,COLUMN()-11)","v":95},{"$f":"2*INDEX('Half-hour data'!$A:$AX,$J7,COLUMN()-11)","v":90.4},{"$f":"2*INDEX('Half-hour data'!$A:$AX,$J7,COLUMN()-11)","v":82.6},{"$f":"2*INDEX('Half-hour data'!$A:$AX,$J7,COLUMN()-11)","v":79.599999999999994},{"$f":"2*INDEX('Half-hour data'!$A:$AX,$J7,COLUMN()-11)","v":75},{"$f":"2*INDEX('Half-hour data'!$A:$AX,$J7,COLUMN()-11)","v":80.2},{"$f":"2*INDEX('Half-hour data'!$A:$AX,$J7,COLUMN()-11)","v":68},{"$f":"2*INDEX('Half-hour data'!$A:$AX,$J7,COLUMN()-11)","v":69.400000000000006},{"$f":"2*INDEX('Half-hour data'!$A:$AX,$J7,COLUMN()-11)","v":77.400000000000006},{"$f":"2*INDEX('Half-hour data'!$A:$AX,$J7,COLUMN()-11)","v":52.6},{"$f":"2*INDEX('Half-hour data'!$A:$AX,$J7,COLUMN()-11)","v":34.799999999999997},{"$f":"2*INDEX('Half-hour data'!$A:$AX,$J7,COLUMN()-11)","v":33},{"$f":"2*INDEX('Half-hour data'!$A:$AX,$J7,COLUMN()-11)","v":30},{"$f":"2*INDEX('Half-hour data'!$A:$AX,$J7,COLUMN()-11)","v":32.200000000000003},{"$f":"2*INDEX('Half-hour data'!$A:$AX,$J7,COLUMN()-11)","v":30.6},{"$f":"2*INDEX('Half-hour data'!$A:$AX,$J7,COLUMN()-11)","v":29.6},{"$f":"2*INDEX('Half-hour data'!$A:$AX,$J7,COLUMN()-11)","v":30.6},{"$f":"2*INDEX('Half-hour data'!$A:$AX,$J7,COLUMN()-11)","v":30.6},{"$f":"2*INDEX('Half-hour data'!$A:$AX,$J7,COLUMN()-11)","v":28},{"$f":"2*INDEX('Half-hour data'!$A:$AX,$J7,COLUMN()-11)","v":26.4},{"$f":"2*INDEX('Half-hour data'!$A:$AX,$J7,COLUMN()-11)","v":29},{"$f":"2*INDEX('Half-hour data'!$A:$AX,$J7,COLUMN()-11)","v":28.6}]
[null,null,null,null,null,null,null,"2024-01-13",6,1109,1,null,"Sat",{"$f":"2*INDEX('Half-hour data'!$A:$AX,$J8,COLUMN()-11)","v":29.6},{"$f":"2*INDEX('Half-hour data'!$A:$AX,$J8,COLUMN()-11)","v":31.2},{"$f":"2*INDEX('Half-hour data'!$A:$AX,$J8,COLUMN()-11)","v":31},{"$f":"2*INDEX('Half-hour data'!$A:$AX,$J8,COLUMN()-11)","v":29.8},{"$f":"2*INDEX('Half-hour data'!$A:$AX,$J8,COLUMN()-11)","v":28},{"$f":"2*INDEX('Half-hour data'!$A:$AX,$J8,COLUMN()-11)","v":28.6},{"$f":"2*INDEX('Half-hour data'!$A:$AX,$J8,COLUMN()-11)","v":29.4},{"$f":"2*INDEX('Half-hour data'!$A:$AX,$J8,COLUMN()-11)","v":27.4},{"$f":"2*INDEX('Half-hour data'!$A:$AX,$J8,COLUMN()-11)","v":30},{"$f":"2*INDEX('Half-hour data'!$A:$AX,$J8,COLUMN()-11)","v":29.2},{"$f":"2*INDEX('Half-hour data'!$A:$AX,$J8,COLUMN()-11)","v":30.8},{"$f":"2*INDEX('Half-hour data'!$A:$AX,$J8,COLUMN()-11)","v":25.6},{"$f":"2*INDEX('Half-hour data'!$A:$AX,$J8,COLUMN()-11)","v":27.4},{"$f":"2*INDEX('Half-hour data'!$A:$AX,$J8,COLUMN()-11)","v":30},{"$f":"2*INDEX('Half-hour data'!$A:$AX,$J8,COLUMN()-11)","v":31.8},{"$f":"2*INDEX('Half-hour data'!$A:$AX,$J8,COLUMN()-11)","v":33.4},{"$f":"2*INDEX('Half-hour data'!$A:$AX,$J8,COLUMN()-11)","v":87},{"$f":"2*INDEX('Half-hour data'!$A:$AX,$J8,COLUMN()-11)","v":85.6},{"$f":"2*INDEX('Half-hour data'!$A:$AX,$J8,COLUMN()-11)","v":85},{"$f":"2*INDEX('Half-hour data'!$A:$AX,$J8,COLUMN()-11)","v":86.2},{"$f":"2*INDEX('Half-hour data'!$A:$AX,$J8,COLUMN()-11)","v":79.2},{"$f":"2*INDEX('Half-hour data'!$A:$AX,$J8,COLUMN()-11)","v":81.400000000000006},{"$f":"2*INDEX('Half-hour data'!$A:$AX,$J8,COLUMN()-11)","v":78.599999999999994},{"$f":"2*INDEX('Half-hour data'!$A:$AX,$J8,COLUMN()-11)","v":84.6},{"$f":"2*INDEX('Half-hour data'!$A:$AX,$J8,COLUMN()-11)","v":80.400000000000006},{"$f":"2*INDEX('Half-hour data'!$A:$AX,$J8,COLUMN()-11)","v":85.4},{"$f":"2*INDEX('Half-hour data'!$A:$AX,$J8,COLUMN()-11)","v":77},{"$f":"2*INDEX('Half-hour data'!$A:$AX,$J8,COLUMN()-11)","v":82.8},{"$f":"2*INDEX('Half-hour data'!$A:$AX,$J8,COLUMN()-11)","v":88.6},{"$f":"2*INDEX('Half-hour data'!$A:$AX,$J8,COLUMN()-11)","v":77.8},{"$f":"2*INDEX('Half-hour data'!$A:$AX,$J8,COLUMN()-11)","v":71.599999999999994},{"$f":"2*INDEX('Half-hour data'!$A:$AX,$J8,COLUMN()-11)","v":69.2},{"$f":"2*INDEX('Half-hour data'!$A:$AX,$J8,COLUMN()-11)","v":67.2},{"$f":"2*INDEX('Half-hour data'!$A:$AX,$J8,COLUMN()-11)","v":73.8},{"$f":"2*INDEX('Half-hour data'!$A:$AX,$J8,COLUMN()-11)","v":65.599999999999994},{"$f":"2*INDEX('Half-hour data'!$A:$AX,$J8,COLUMN()-11)","v":58.4},{"$f":"2*INDEX('Half-hour data'!$A:$AX,$J8,COLUMN()-11)","v":34.799999999999997},{"$f":"2*INDEX('Half-hour data'!$A:$AX,$J8,COLUMN()-11)","v":29},{"$f":"2*INDEX('Half-hour data'!$A:$AX,$J8,COLUMN()-11)","v":31.2},{"$f":"2*INDEX('Half-hour data'!$A:$AX,$J8,COLUMN()-11)","v":28.4},{"$f":"2*INDEX('Half-hour data'!$A:$AX,$J8,COLUMN()-11)","v":30.4},{"$f":"2*INDEX('Half-hour data'!$A:$AX,$J8,COLUMN()-11)","v":27.2},{"$f":"2*INDEX('Half-hour data'!$A:$AX,$J8,COLUMN()-11)","v":28.6},{"$f":"2*INDEX('Half-hour data'!$A:$AX,$J8,COLUMN()-11)","v":30.4},{"$f":"2*INDEX('Half-hour data'!$A:$AX,$J8,COLUMN()-11)","v":27.4},{"$f":"2*INDEX('Half-hour data'!$A:$AX,$J8,COLUMN()-11)","v":24.8},{"$f":"2*INDEX('Half-hour data'!$A:$AX,$J8,COLUMN()-11)","v":29.2},{"$f":"2*INDEX('Half-hour data'!$A:$AX,$J8,COLUMN()-11)","v":30.4}]
{"$rows_left_out":26}
{"sheet":"Half-hour data","index":2,"n_rows":3653,"n_cols":50,"rows_kept":3653,"cut":false,"hidden":false,"merged":[]}
["Date","Hour:","00:00:00","00:30:00","01:00:00","01:30:00","02:00:00","02:30:00","03:00:00","03:30:00","04:00:00","04:30:00","05:00:00","05:30:00","06:00:00","06:30:00","07:00:00","07:30:00","08:00:00","08:30:00","09:00:00","09:30:00","10:00:00","10:30:00","11:00:00","11:30:00","12:00:00","12:30:00","13:00:00","13:30:00","14:00:00","14:30:00","15:00:00","15:30:00","16:00:00","16:30:00","17:00:00","17:30:00","18:00:00","18:30:00","19:00:00","19:30:00","20:00:00","20:30:00","21:00:00","21:30:00","22:00:00","22:30:00","23:00:00","23:30:00"]
["2021-01-01","kWh","For new half hourly kWh data:"]
[{"$f":"A2+1","v":"2021-01-02"},"kWh","– delete kWh data in the yellow cells below"]
[{"$f":"A3+1","v":"2021-01-03"},"kWh","– paste in kWh values starting from their correct starting date"]
["2021-01-04","kWh","– so there is no need to edit the Date column"]
["2021-01-05","kWh"]
["2021-01-06","kWh"]
["2021-01-07","kWh"]
{"$rows_left_out":3645}